‘stderr’ was not declared in this scope

Description

Hash.cc: In member function ‘void Hash<K, V>::debugPrint()’:
Hash.cc:181: error: ‘stderr’ was not declared in this scope
make[1]: *** [Hash.o] Error 1
make[1]: Leaving directory `/home/sroddy/tm-20090206'
make: *** [all] Error 2

Building on Ubuntu 10.04.1 server.

Adding '#include <cstdio>' to Hash.hh fixes build problem.

Environment

None

Activity

Show:
gregor
July 22, 2011, 4:59 AM

fixed in current master

Fixed

Assignee

Unassigned

Reporter

sroddy

Labels

None

Priority

Low